{"text_format":"1","workbook":"xlsx","n_sheets":5,"sheets":["R C KPI Form","CO2 Emission Calculation","Guidelines","emptykm","gCO2 tonne-km"],"not_rendered":{"charts":0,"images":2,"macros":1,"external_links":0,"defined_names":2,"comments":0,"pivot_tables":0},"unopened":[],"bounds":{"document_bytes":16777216,"sheet_cells":100000,"rows_first":2000,"rows_last":500,"rows_between":2000,"halvings":0,"cell_chars":16384,"cell_head_chars":4096},"cells_cut":0,"cells_raw":0,"read":"whole","date_system":"1900"}

{"sheet":"R C KPI Form","index":0,"n_rows":71,"n_cols":11,"rows_kept":71,"cut":false,"hidden":false,"merged":[[26,9,26,10],[19,0,19,1],[26,0,26,2],[26,3,26,5],[37,0,37,1],[0,1,2,2],[26,6,26,8],[4,1,4,2],[5,1,5,2],[65,0,65,1]]}
[null,"KPI FORM - TRANSPORT"]
[]
[]
[]
["Company Name"]
["Period (Year)"]
[]
["1. Number of km operated per year for chemical goods transportation in Europe (mln kms p.a.)"]
["1a. Number of Moves (Orders) per year"]
["2. Tonnes carried per year"]
[]
["3.    Number of employees - incl. Subcontractors - Drivers"]
["3a. Number of employees - Others"]
[]
["3b. Training days per driver per year"]
[]
["3c. Training days per office staff per year"]
["3d. Driver absence in days per annum"]
[]
["4.  Mode of transport used"]
["Road"]
["Intermodal"]
["Total",{"$f":"SUM(B21:B22)","v":0},{"$f":"IF(B23<>1,\"The Total must be 100%!\",\"\")","v":"The Total must be 100%!"}]
[]
[]
[]
["5. Number of incidents with motor vehicles for this year - whilst in transit",null,null,"6. Number of incidents at loading points for this year",null,null,"6a. Number of incidents at unloading points for this year",null,null,"Totals"]
[null,"Own Fleet/Driver","Sub Contractor",null,"Own Fleet/Driver","Sub Contractor",null,"Own Fleet/Driver","Sub Contractor","Own Fleet/Driver","Sub Contractor"]
["Death",null,null,"Death",null,null,"Death",null,null,{"$f":"H29+E29+B29","v":0},{"$f":"I29+F29+C29","v":0}]
["Losttime-Injury",null,null,"Losttime-Injury",null,null,"Lost time-Injury",null,null,{"$f":"H30+E30+B30","v":0},0]
["Loss of Product",null,null,"Loss of Product",null,null,"Loss of Product",null,null,0,0]
["Damage ",null,null,"Damage ",null,null,"Damage ",null,null,0,0]
["Rollovers",null,null,null,null,null,null,null,null,{"$f":"B33","v":0},{"$f":"C33","v":0}]
["Involvement of Authorities",null,null,"Involvement of Authorities",null,null,"Involvement of Authorities",null,null,0,0]
["Total",{"$f":"SUM(B29:B34)","v":0},{"$f":"SUM(C29:C34)","v":0},"Total",{"$f":"E29+E30+E31+E32+E34","v":0},{"$f":"F29+F30+F31+F32+F34","v":0},"Total",{"$f":"H29+H30+H31+H32+H34","v":0},{"$f":"I29+I30+I31+I32+I34","v":0},{"$f":"J29+J30+J31+J32+J34","v":0},{"$f":"K29+K30+K31+K32+K34+K33","v":0}]
[]
[]
["7. Split of trucks used for chemical transport"]
["EURO I / II / III"]
["EURO IV"]
["EURO V"]
["EURO VI"]
["Alternative Combustion (Hybrid/Fully Electric/LNG/Hydrogen Cells..)"]
[]
["Total",{"$f":"SUM(B39:B44)","v":0}]
[null,null,{"$f":"IF(B45<>1,\"The Total must be 100%!\",\"\")","v":"The Total must be 100%!"}]
["8. Energy Based data (optional)"]
["8a. Total Fuel consumption for the year - Litres "]
["8b. CO2 Factor  "]
["8c. Total   (8a x 8b) Kgs CO2 /1000 = Tonnes CO2"]
[]
["9. Activity Based data (optional)","CO2 Tonnage"]
["Road transport ",{"$f":"'CO2 Emission Calculation'!K4","v":0}]
["Rail transport",{"$f":"'CO2 Emission Calculation'!K5","v":""}]
["Barge transport",{"$f":"'CO2 Emission Calculation'!K6","v":""}]
["Short sea",{"$f":"'CO2 Emission Calculation'!K7","v":""}]
["Intermodal road/rail",{"$f":"'CO2 Emission Calculation'!K8","v":""}]
["Intermodal road/barge",{"$f":"'CO2 Emission Calculation'!K9","v":""}]
["Intermodal road/short sea",{"$f":"'CO2 Emission Calculation'!K10","v":""}]
[]
["Average g CO2 / ton-km (from CO2 Emission Calculation)*",{"$f":"IF(ISERROR(D61),\"\",IF(B62=\"\",D61,\"\"))","v":""},null,{"$f":"'CO2 Emission Calculation'!K14","v":{"$error":"#DIV/0!"}}]
["Average g CO2 / ton-km (from own system calculation**"]
[]
["10 Total Tonnes CO2 (optional)",{"$f":"'CO2 Emission Calculation'!K13","v":0}]
[]
["Chapters 8, 9 and 10 can be completed on a voluntary basis"]
["The calculation of Fuel Consumption and CO2 production is based on the report \"Measuring and managing CO2 emissions of European chemical transport\" by Prof Alan McKinnon. There is also the ECTA Responsible Care Guidelines document that has been developed to assist all R C Coordinators to complete the KPI form."]
[]
[]
["  * based on \"CO2 Emission Calculation\""]
["** based on own system calculation"]

{"sheet":"CO2 Emission Calculation","index":1,"n_rows":20,"n_cols":12,"rows_kept":20,"cut":false,"hidden":false,"merged":[]}
["Calculation Template for CO2-Emissions from Freight Transport Operations"]
[]
["Mode of Transport","Nr. of transports","average ton/transport ","Tons","Avg kms (estimates!)","% of truck-kms run empty","Ton-kms",null,"g CO2/ ton-km",null,"Tons CO2"]
["Road transport ",45,12,{"$f":"IF(B4=\"\",\"\",B4*C4)","v":540},null,0,{"$f":"IF(B4=\"\",\"\",E4*D4)","v":0},null,{"$f":"INDEX(emptykm!D19:O39,MATCH(C4,emptykm!D19:D39,0),MATCH(F4,emptykm!D19:O19,0))","v":69.692236980339189},null,{"$f":"IF(B4=\"\",\"\",+I4*G4/1000/1000)","v":0}]
["Rail transport",null,null,"",null,null,"",null,{"$f":"IF(B5=\"\",\"\",22)","v":""},null,{"$f":"IF(B5=\"\",\"\",+I5*G5/1000/1000)","v":""}]
["Barge transport",null,null,{"$f":"IF(B6=\"\",\"\",B6*C6)","v":""},null,null,{"$f":"IF(B6=\"\",\"\",E6*D6)","v":""},null,{"$f":"IF(B6=\"\",\"\",31)","v":""},null,""]
["Short sea",null,null,{"$f":"IF(B7=\"\",\"\",B7*C7)","v":""},null,null,{"$f":"IF(B7=\"\",\"\",E7*D7)","v":""},null,{"$f":"IF(B7=\"\",\"\",16)","v":""},null,""]
["Intermodal road/rail",null,null,"",null,null,"",null,{"$f":"IF(B8=\"\",\"\",26)","v":""},null,""]
["Intermodal road/barge",null,null,"",null,null,"",null,{"$f":"IF(B9=\"\",\"\",34)","v":""},null,""]
["Intermodal road/short sea",null,null,"",null,null,"",null,{"$f":"IF(B10=\"\",\"\",21)","v":""},null,""]
[]
[]
["TOTAL",{"$f":"SUM(B4:B10)","v":45},null,{"$f":"SUM(D4:D12)","v":540},null,null,{"$f":"SUM(G4:G12)","v":0},null,null,null,{"$f":"SUM(K4:K10)","v":0},"Tot Tons CO2"]
[null,null,null,null,null,null,null,null,null,null,{"$f":"(K13/G13)*1000*1000","v":{"$error":"#DIV/0!"}}," Average g CO2 / ton-km"]
[]
[]
[]
[]
[]
["g CO2 / ton-km according to \"Measuring and Managing CO2 Emissions of European Chemical Transport\" by Professor Alan McKinnon"]

{"sheet":"Guidelines","index":2,"n_rows":239,"n_cols":1,"rows_kept":239,"cut":false,"hidden":false,"merged":[]}
["Definitions of KPI’s required"]
[]
["1. Number of km operated per year for chemical goods transportation in Europe (mio.km/year)"]
["Performance Measure"]
["Total million kilometres (of all modes) executed for the chemical industry including subcontractors."]
[]
["Purpose"]
["Reflects the total number of km (road and intermodal) done by the LSP and subcontractors for the chemical industry. This KPI allows relative performance data to clarify the importance of the RC scheme."]
[]
["Definitions"]
["Chemicals: All chemical products, including not only finished products, but also samples, raw materials, intermediates, wastes, etc., whether or not classified as dangerous according to the UN Recommendations for the Transport of Dangerous Goods (Cefic definition)."]
["Chemical Goods: the definition applied by Cefic and ICCA is accepted by ECTA, meaning that includes all products made by chemical producers, for instance includes fine chemicals, organic chemicals, sulphuric acid and minerals. There is no restriction to Petrochemicals, but fuel distribution (LPG, petrol, etc) is not included in the chemical transport market under ECTA RC scheme."]
[]
["Reporting Instructions"]
["Calculate all km for chemical producers, irrespective of the modal choice of the transport. Include km estimates for intermodal legs."]
[]
["Includes all modes and transit between loading and final destination, includes trips to and from terminals, cleaning stations and includes empty legs."]
[]
[]
[]
["1a. Number of Moves (Orders) per year"]
["This is calculated from actual moves as per collections / deliveries performed including subcontractors. "]
[]
[]
["2. Tonnes carried per year"]
["A calculation from moves made and payload carried per annum including subcontractors."]
[]
[]
["3. & 3a. Number of employees – Drivers/subcontractors and office/planning staff"]
[]
["Performance Measure"]
["Number of FTE employees in the RC LSP (including subcontractors)."]
[]
["Purpose"]
["Shows how many people are employed by the RC LSP and indicates the number of people who are in contact with the concept of Responsible Care."]
[]
["Definitions"]
["As applied in social legislation to calculate FTE (Full Time Equivalent)."]
[]
["Reporting Instructions"]
["FTE equivalent. Use figures of annual reports."]
[]
[]
[]
["3b. & 3c. Training days per driver/subcontractors and office/planning staff per year"]
[]
["Performance Measure"]
["This KPI measures the number of training days per driver/office staff per year."]
["This is to measure the overall training for the company. Subcontractors are included in this reporting."]
[]
["This KPI allows the LSP to express the impact of investments in training."]
[]
["Purpose"]
["To be able to measure the importance of total personnel training for the movement of chemical goods."]
[]
["Definitions"]
["ADR: \"European Agreement Concerning the International Carriage of Dangerous Goods by Road\", Volume II, by the United Nations, last revision."]
[]
["BBS: Behaviour Based Safety training, refers to the ECTA/CEFIC documents \"Behaviour Based Safety – Guidelines for safe driving of road freight vehicles\" from October 2003 as well as “Behaviour Based Safety – Guidelines for the safe loading and unloading of road freight vehicles\" from November 2004 (issue 2 from March 2007)."]
[]
["European Directive 2003/59/EC – Initial qualification and periodic training for drivers of road vehicles for the carriage of goods or passengers"]
[]
["Reporting Instructions"]
["Drivers"]
["All training days can be included for example ADR training, load securing, internal training, defensive driving, BBS, statutory training, etc. Average of training days per driver/office staff per year should meet or exceed the EU directive."]
[]
["3d. Driver days absence per annum"]
[]
["This KPI is self explanatory and should include all absences that are not notified prior to being absent."]
[]
[]
[]
["4. Mode of transport used"]
[]
["Performance Measure"]
["Gives percentage split of transport modes used including subcontractors."]
[]
["Purpose"]
["To follow up the environmental choices made in logistics for chemical products."]
[]
["Definitions"]
["Road is transport handled under drivers' care from loading to unloading sites."]
["Intermodal transport: Movement of goods (in one and the same loading unit or a vehicle) by successive modes of transport without handling of the goods themselves when changing modes. Other used terms are multimodal transport or combined transport."]
[]
["European Conference of Ministers of Transport (ECMT) defines multimodal (intermodal) transport as the \"carriage of goods by at least two different modes of transport\"."]
[]
["For transport policy purposes the ECMT restricts the term combined transport to cover: \"Intermodal transport where the major part of the European journey is by rail, inland waterways or sea and any initial and/or final leg carried out by road are as short as possible\"."]
["Reporting Instructions"]
["There should only be two categories: road and intermodal. Report as a percentage; the total must be 100%."]
[]
[]
[]
["5. Number of incidents with motor vehicles for the year – whilst in transit"]
[]
["Performance Measure"]
["This KPI measures accidents whilst in transit on the road, including subcontractors."]
[]
["Purpose"]
["To be able to calculate an industry average, identify weak points and have in place an improvement plan."]
[]
["Definitions (definitions according to Cefic)"]
["Accidents: Any occurrence involving a commercial motor vehicle on highway, national or local roads resulting in a fatality, injury to a person requiring immediate treatment away from the scene of the accident, disabling damage to a vehicle requiring it to be towed from the scene, loss of product or involvement of authorities."]
["Transport: The \"in-transit\" transport of chemicals by motor vehicles between the site of a supplying company and that of the final destination, excluding transport activities at loading and unloading premises of the supplying chemical company and the final destination."]
[]
["Death: when death results from the accident (up to 30 days after the accident) irrespective whether or not the chemical product contributed to the death."]
["Injury: where the injury requires intensive medical treatment, or requires a stay in hospital of at least one day, or results in the inability to work for at least three consecutive days irrespective of whether or not the chemical product contributed to the injury."]
[]
["Loss of product: any release of product"]
[]
["·         Dangerous goods – release of product of more than 50 kg or litres;"]
["·         Non-dangerous goods – release of more than 1000 kg or litres."]
[]
["Damage: any damage exceeding EURO 20.000 to the property of any party (including environmental cleaning up), resulting from the transport incident, irrespective of whether or not the chemical product contributed to the damage."]
[]
["Involvement of authorities: direct involvement of the authorities or emergency services in the transport accident/incident or the evacuation of persons or closure of public traffic routes for three hours or more caused by the transport accident/incident."]
[]
["Rollover: the vehicle and associated equipment (tank/container) has rolled over onto its side."]
[]
["Reporting Instructions"]
["This KPI does not apply to rail, shipping or barge movements. This KPI applies to all intermodal road movements."]
{"$rows_left_out":120}
{"sheet":"emptykm","index":3,"n_rows":39,"n_cols":24,"rows_kept":39,"cut":false,"hidden":false,"merged":[[3,4,3,23],[17,4,17,14]]}
["according to \"Measuring and Managing CO2 Emissions of European Chemical Transport\" by Professor Alan McKinnon and Dr Maja Piecyk"]
["Table 1"]
[]
[null,null,null,null,"load tonnes"]
[null,null,null,"% of truck-kms run empty",10,11,12,13,14,15,16,17,18,19,20,21,22,23,24,25,26,27,28,29]
[null,null,null,0,81,74.8,69.7,65.383735358566625,61.723241285348763,58.582692686773122,55.866142324350349,53.5,51.4,49.6,48,46.6,45.3,44.2,43.2,42.3,41.5,40.799999999999997,40.200000000000003,39.700000000000003]
[null,null,null,0.05,84.7,78.2,72.8,68.221850265971113,64.358633699367218,61.042392273190345,58.172110686616492,55.7,53.5,51.5,49.8,48.3,47,45.8,44.7,43.8,42.9,42.2,41.5,41]
[null,null,null,0.1,88.8,81.900000000000006,76.2,71.375311274198339,67.286847492721051,63.775391813653926,60.7,58.1,55.8,53.7,51.9,50.3,48.8,47.6,46.4,45.4,44.5,43.7,43,42.4]
[null,null,null,0.15,93.4,86.1,80,74.899767695158161,70.559557026469477,66.829920711819128,63.6,60.8,58.3,56.1,54.2,52.5,50.9,49.6,48.3,47.3,46.3,45.4,44.6,44]
[null,null,null,0.2,98.5,90.8,84.3,78.864781168737977,74.24135525193644,70.266265722254957,66.8,63.8,61.2,58.8,56.8,54.9,53.3,51.8,50.5,49.3,48.3,47.3,46.5,45.7]
[null,null,null,0.25,104.4,96.1,89.2,83.358463105461752,78.414059907465671,74.160790067415562,70.5,67.2,64.400000000000006,61.9,59.7,57.7,55.9,54.3,52.9,51.7,50.5,49.5,48.6,47.8]
[null,null,null,0.3,111.1,102,94.7,88.494099604574657,83.182865228070511,78.611675033313389,74.599999999999994,71.2,68.099999999999994,65.400000000000006,63,60.9,59,57.2,55.7,54.3,53.1,52,51,50.1]
[null,null,null,0.35,118.8,109.1,101.1,94.419834026627981,88.685332905691453,83.747311532426295,79.5,57.7,72.400000000000006,69.5,66.900000000000006,64.5,62.5,60.6,58.9,57.4,56,54.8,53.7,52.7]
[null,null,null,0.4,127.8,117.3,108.6,101.33319085235686,95.104878529582564,89.738887448057994,85.1,81,77.400000000000006,74.2,71.400000000000006,68.8,66.5,64.5,62.7,61,59.5,58.1,56.9,55.8]
[null,null,null,0.45,138.4,127,117.5,109.5035216464001,102.69161426690842,96.819840802895456,91.7,87.2,83.3,79.8,76.7,73.900000000000006,71.400000000000006,69.099999999999994,67.099999999999994,65.2,63.6,62.1,60.7,59.5]
[null,null,null,0.5,151.1,138.6,128.1,119.30791859925201,111.79569715169949,105.31698482870044,99.7,94.7,90.4,86.5,83,80,77.2,74.7,72.400000000000006,70.3,68.5,66.8,65.3,63.9]
[]
[null,null,null,"load","% of truck-kms run empty"]
[null,null,null,"tonnes",0,0.05,0.1,0.15,0.2,0.25,0.3,0.35,0.4,0.45,0.5]
[null,null,null,10,81.022355507088335,84.711904886714166,88.811404197409544,93.393197544657326,98.547715060311077,104.38950157805199,111.06582902689875,118.7692837755681,127.75664764901565,138.37807768127189,151.12379371997932]
[null,null,null,11,74.823509270169296,78.177645069829154,81.904462625006772,86.069729304322934,90.755654318553624,96.066369334681724,102.1357579245424,109.13889860515089,117.30922939919414,126.96507488306342,138.55208946370658]
[null,null,null,12,69.692236980339189,72.766861463360712,76.183110888940192,80.001272011646691,84.296703274691481,89.16485870614224,94.728464913514543,101.14801053740565,108.63748043194529,117.48867212549213,128.11010215774834]
[null,null,null,13,65.383735358566625,68.221850265971113,71.375311274198339,74.899767695158161,78.864781168737977,83.358463105461752,88.494099604574657,94.419834026627981,101.33319085235686,109.5035216464001,119.30791859925201]
[null,null,null,14,61.723241285348763,64.358633699367218,67.286847492721051,70.559557026469477,74.24135525193644,78.414059907465671,83.182865228070511,88.685332905691453,95.104878529582564,102.69161426690842,111.79569715169949]
[null,null,null,15,58.582692686773122,61.042392273190345,63.775391813653926,66.829920711819128,70.266265722254957,74.160790067415562,78.611675033313389,83.747311532426295,89.738887448057994,96.819840802895456,105.31698482870044]
[null,null,null,16,55.866142324350349,58.172110686616492,60.734297755801109,63.597918597830976,66.819492045114572,70.470608618702641,74.643313274231858,79.457972492150191,85.075074913054934,91.713468683215041,99.679541207407226]
[null,null,null,17,53.500320436657958,55.670643601143745,58.082113783905733,60.777286341110312,63.80935546796546,67.24570047840129,71.172951918899372,75.70439588870488,80.991080520144607,87.238980539118856,94.736460561887938]
[null,null,null,18,51.428343993133431,53.478093648481114,55.75559326553411,58.30103401400509,61.164654856034957,64.410091810335473,68.119162615250332,72.398859697844415,77.391839627537493,83.292634089902066,90.373587444739528]
[null,null,null,19,49.605413381226761,51.547281475766674,53.704912691922139,56.116382874684135,58.829286830291366,61.903911313312904,65.41776786533751,69.472217733058216,74.202409245399025,79.792635578165473,86.500907177485189]
[null,null,null,20,47.995801033591732,49.840575723404648,51.890325378752337,54.181222052376235,56.75848081020311,59.679374069073567,63.017537793496949,66.869265167831614,71.362947104555388,76.673662120683503,83.046520140037231]
[null,null,null,21,46.570701467371208,48.327629743383518,50.279772272286074,52.461578628118346,54.916110778429662,57.697913882115806,60.877117429185695,64.545429214266335,68.825126296860404,73.882950121744315,79.952338711605023]
[null,null,null,22,45.306668780642497,46.983736680472425,48.847145458061235,50.929778797719315,53.272741304834653,55.928098812898703,58.96279310782905,62.464363448133298,66.54952884515491,71.377451587089553,77.170958877411138]
[null,null,null,23,44.184462959328712,45.788614863513857,47.571005868164022,49.563089932184795,51.804184504208166,54.344091685834648,57.246842750550627,60.596170902146,64.503720412340599,69.121733469843292,74.663349138846542]
[null,null,null,24,43.188185918898817,44.725498160409586,46.433622873199326,48.342703434552568,50.490419066074963,52.924496781800343,55.706299885486494,58.91607269743205,62.660807644701869,67.086403491475295,72.397118507603395]
[null,null,null,25,42.304626334519568,43.780446086369899,45.420245810648048,47.252963149547163,49.314770155808667,51.651484762905035,54.322015742443732,57.403397641911468,60.998343191290495,65.246915204192987,70.345201619675962]
[null,null,null,26,41.522757248563707,42.941814702265951,44.518545206379564,46.280773416859475,48.263280153649383,50.51012112201127,53.077939371567723,56.040806582594385,59.497484995458834,63.582650392480446,68.484848868906397]
[null,null,null,27,40.833347073145269,42.19984684337706,43.718179921412386,45.415140420393051,47.324220981746286,49.487845617946633,51.960559487889874,54.813690876285918,58.142344162747975,62.076207137657676,66.796842707549345]
[null,null,null,28,40.228655895347835,41.546352102357062,43.010458999033986,44.646813765908185,46.487712878641673,48.574065206406289,50.958467866708702,53.70970170551918,56.919474517464735,60.712842386127662,65.264883828523182]
[null,null,null,29,39.702196786311632,40.974455193079166,42.388075645043081,43.968004385473357,45.745424218457408,47.759833362506001,50.062015241418678,52.718378947856372,55.817469938700363,59.480032018788705,63.875106514894732]

{"sheet":"gCO2 tonne-km","index":4,"n_rows":11,"n_cols":2,"rows_kept":11,"cut":false,"hidden":false,"merged":[]}
["according to \"Measuring and Managing CO2 Emissions of European Chemical Transport\" by Professor Alan McKinnon and Dr Maja Piecyk"]
["Table 8"]
[]
["Transport mode","gCO2/tonne-km"]
["Road Transport",62]
["Rail Transport",22]
["Barge transport",31]
["Short sea",16]
["Intermodal road/rail",26]
["Intermodal road/barge",34]
["Intermodal road/short sea",21]